{"text_format":"1","workbook":"xlsx","n_sheets":6,"sheets":["Cover","Report ","OOS","Footnotes","Stacked&Idle","Disclaimers&Definitions "],"not_rendered":{"charts":0,"images":8,"macros":0,"external_links":2,"defined_names":25,"comments":0,"pivot_tables":0},"unopened":[],"bounds":{"document_bytes":16777216,"sheet_cells":100000,"rows_first":2000,"rows_last":500,"rows_between":2000,"halvings":0,"cell_chars":16384,"cell_head_chars":4096},"cells_cut":0,"cells_raw":0,"read":"whole","date_system":"1900"}

{"sheet":"Cover","index":0,"n_rows":11,"n_cols":1,"rows_kept":11,"cut":false,"hidden":false,"merged":[]}
[]
[]
[]
[]
[]
[]
[]
[]
[]
[]
[" "]

{"sheet":"Report ","index":1,"n_rows":33,"n_cols":22,"rows_kept":33,"cut":false,"hidden":false,"merged":[[2,0,2,12],[3,0,3,12],[5,14,5,17],[5,18,5,21],[6,14,6,17],[6,18,6,21]]}
[]
["Updated: September 18, 2013"]
["Revisions Noted in Bold"]
["Dynamically positioned «"]
[]
[null,null,null,null,"Yr. (1)","Water","Drilling ",null,null,"Estimated","Estimated","Dayrate on","Dayrate on",null,"Estimated Out of Service Days (4)",null,null,null,"Estimated Out of Service Days (4)"]
[null,"Footnote ","Floater","Dynamically","Entered","Depth","Depth",null,null," Contract","Expiration","Current Contract (3)","Previous Contract (3)",null,2013,null,null,null,2014]
["Rig Type/Name","References","Type","Positioned","Service","(Feet)","(Feet)","Location","Customer","Start Date (2)"," Date (2)","(Dollars)","(Dollars)",null,"Q1","Q2","Q3","Q4","Q1","Q2","Q3","Q4"]
["High Specification Floater: Ultra-Deepwater"]
[]
["Discoverer Americas",-6,"ship","«",2009,12000,40000,"Mozambique","Statoil","2013-03-01","2013-09-01",585000,509000,null,0,0,{"$f":"VLOOKUP($A11,'[1]2013'!$B$4:$V$48,20,FALSE)","v":0},{"$f":"VLOOKUP($A11,'[1]2013'!$B$4:$V$48,21,FALSE)","v":0},{"$f":"VLOOKUP($A11,'[1]2014'!$B$4:$R$51,14,FALSE)","v":0},{"$f":"VLOOKUP($A11,'[1]2014'!$B$4:$R$51,15,FALSE)","v":0},{"$f":"VLOOKUP($A11,'[1]2014'!$B$4:$R$51,16,FALSE)","v":45},{"$f":"VLOOKUP($A11,'[1]2014'!$B$4:$R$51,17,FALSE)","v":0}]
[null,-6,null,null,null,null,null,"Tanzania","Statoil","2013-09-01","2014-12-31",636000,585000,null," "," "]
[null,-6,null,null,null,null,null,"USGOM","Statoil","2014-12-31","2016-05-01",600000,636000]
["Discoverer Deep Seas",-6,"ship","«",2001,10000,35000,"USGOM","Chevron","2011-02-01","2013-09-01",456000,517000,null,0,0,0,0,0,0,0,0]
[null,-6,null,null,null,null,null,"USGOM","Murphy Oil",{"$f":"K14","v":"2013-09-01"},"2016-09-01",595000,456000,null," "," "]
["Discoverer Spirit",-6,"ship","«",2000,10000,35000,"USGOM","Anadarko","2012-07-01","2014-06-01",555000,546000,null,0,0,{"$f":"VLOOKUP($A16,'[1]2013'!$B$4:$V$48,20,FALSE)","v":0},{"$f":"VLOOKUP($A16,'[1]2013'!$B$4:$V$48,21,FALSE)","v":7},{"$f":"VLOOKUP($A16,'[1]2014'!$B$4:$R$51,14,FALSE)","v":0},{"$f":"VLOOKUP($A16,'[1]2014'!$B$4:$R$51,15,FALSE)","v":0},{"$f":"VLOOKUP($A16,'[1]2014'!$B$4:$R$51,16,FALSE)","v":84},{"$f":"VLOOKUP($A16,'[1]2014'!$B$4:$R$51,17,FALSE)","v":0}]
["GSF Jack Ryan"," (6), (14)","ship","«",2000,10000,35000,"Nigeria","Total","2009-06-01","2014-07-01",445000,297000,null,0,0,0,0,0,0,5,92]
["Deepwater Millennium","(7)","ship","«",1999,10000,30000,"Australia","Woodside","2014-02-01","2015-01-01",600000,570000,null,0,0,{"$f":"VLOOKUP($A18,'[1]2013'!$B$4:$V$48,20,FALSE)","v":38},{"$f":"VLOOKUP($A18,'[1]2013'!$B$4:$V$48,21,FALSE)","v":92},{"$f":"VLOOKUP($A18,'[1]2014'!$B$4:$R$51,14,FALSE)","v":54},{"$f":"VLOOKUP($A18,'[1]2014'!$B$4:$R$51,15,FALSE)","v":0},{"$f":"VLOOKUP($A18,'[1]2014'!$B$4:$R$51,16,FALSE)","v":0},{"$f":"VLOOKUP($A18,'[1]2014'!$B$4:$R$51,17,FALSE)","v":0}]
[null,"(7)",null,null,null,null,null,"Australia","Woodside",{"$f":"+K18","v":"2015-01-01"},"2016-01-01",611000,{"$f":"+L18","v":600000},null," "," "]
[]
["High Specification Floater: Deepwater"]
[]
["Transocean Marianas",-8,"semi",null,"1979/1998",7000,30000,"Namibia","HRT","2013-03-01","2013-10-31",530000,456000,null,61.958333333333343,0,0,0,0,35,57,0]
["Sedco 702","(6), (7)","semi","«","1973/2007",6500,25000,"Nigeria","Shell","2012-09-01","2016-01-01",461000,357000,null,0,0,{"$f":"VLOOKUP($A24,'[1]2013'!$B$4:$V$48,20,FALSE)","v":0},{"$f":"VLOOKUP($A24,'[1]2013'!$B$4:$V$48,21,FALSE)","v":78},{"$f":"VLOOKUP($A24,'[1]2014'!$B$4:$R$51,14,FALSE)","v":42},{"$f":"VLOOKUP($A24,'[1]2014'!$B$4:$R$51,15,FALSE)","v":0},{"$f":"VLOOKUP($A24,'[1]2014'!$B$4:$R$51,16,FALSE)","v":0},{"$f":"VLOOKUP($A24,'[1]2014'!$B$4:$R$51,17,FALSE)","v":0}]
["M.G. Hulme, Jr.",-7,"semi",null,"1983/1996",5000,25000,"India","ONGC","2011-09-01","2014-01-31",189000,"N/A",null,0,0,{"$f":"VLOOKUP($A25,'[1]2013'!$B$4:$V$48,20,FALSE)","v":0},{"$f":"VLOOKUP($A25,'[1]2013'!$B$4:$V$48,21,FALSE)","v":0},{"$f":"VLOOKUP($A25,'[1]2014'!$B$4:$R$51,14,FALSE)","v":0},{"$f":"VLOOKUP($A25,'[1]2014'!$B$4:$R$51,15,FALSE)","v":0},{"$f":"VLOOKUP($A25,'[1]2014'!$B$4:$R$51,16,FALSE)","v":0},{"$f":"VLOOKUP($A25,'[1]2014'!$B$4:$R$51,17,FALSE)","v":0}]
["Sedco 710",-12,"semi","«","1983/2001",4500,25000,"Brazil",null,null,"Stacked",null,null,null,0,40,{"$f":"VLOOKUP($A26,'[1]2013'!$B$4:$V$48,20,FALSE)","v":0},{"$f":"VLOOKUP($A26,'[1]2013'!$B$4:$V$48,21,FALSE)","v":0},{"$f":"VLOOKUP($A26,'[1]2014'!$B$4:$R$51,14,FALSE)","v":0},{"$f":"VLOOKUP($A26,'[1]2014'!$B$4:$R$51,15,FALSE)","v":0},{"$f":"VLOOKUP($A26,'[1]2014'!$B$4:$R$51,16,FALSE)","v":0},{"$f":"VLOOKUP($A26,'[1]2014'!$B$4:$R$51,17,FALSE)","v":0}]
["Transocean Rather",null,"semi",null,1988,4500,25000,"Angola",null,null,"Stacked",null,null,null,0,0,{"$f":"VLOOKUP($A27,'[1]2013'!$B$4:$V$48,20,FALSE)","v":0},{"$f":"VLOOKUP($A27,'[1]2013'!$B$4:$V$48,21,FALSE)","v":0},0,{"$f":"VLOOKUP($A27,'[1]2014'!$B$4:$R$51,15,FALSE)","v":0},{"$f":"VLOOKUP($A27,'[1]2014'!$B$4:$R$51,16,FALSE)","v":0},{"$f":"VLOOKUP($A27,'[1]2014'!$B$4:$R$51,17,FALSE)","v":0}]
[]
["Midwater Floaters  "]
[]
["Transocean Legend",null,"semi",null,1983,3500,25000,"Australia ","Conoco Phillips","2012-03-01","2014-03-01",293000,300000,null,0,0,{"$f":"VLOOKUP($A31,'[1]2013'!$B$4:$V$48,20,FALSE)","v":0},{"$f":"VLOOKUP($A31,'[1]2013'!$B$4:$V$48,21,FALSE)","v":11},{"$f":"VLOOKUP($A31,'[1]2014'!$B$4:$R$51,14,FALSE)","v":34},{"$f":"VLOOKUP($A31,'[1]2014'!$B$4:$R$51,15,FALSE)","v":0},{"$f":"VLOOKUP($A31,'[1]2014'!$B$4:$R$51,16,FALSE)","v":0},{"$f":"VLOOKUP($A31,'[1]2014'!$B$4:$R$51,17,FALSE)","v":0}]
[null,null,null,null,null,null,null,"Australia","Conoco Phillips","2014-03-01","2014-09-30",425000,293000]
["Falcon 100",-13,"semi",null,"1974/1999",2400,25000,"Congo","Soco International","2013-07-18","2013-09-25",300000,"N/A",null,0,40,4,0,0,0,0,0]

{"sheet":"OOS","index":2,"n_rows":172,"n_cols":40,"rows_kept":172,"cut":false,"hidden":true,"merged":[[5,18,5,21],[6,18,6,21],[2,0,2,12],[3,0,3,12],[6,14,6,17],[5,14,5,17]]}
[]
["Updated: July 17, 2013"]
["Revisions Noted in Bold"]
["Dynamically positioned «"]
[]
[null,null,null,null,"Yr. (1)","Water","Drilling ",null,null,"Estimated","Estimated","Dayrate on","Dayrate on",null,"Estimated Out of Service Days (4)",null,null,null,"Estimated Out of Service Days (4)"]
[null,"Footnote ","Floater","Dynamically","Entered","Depth","Depth",null,null," Contract","Expiration","Current Contract (3)","Previous Contract (3)",null,2013,null,null,null,2014]
["Rig Type/Name","References","Type","Positioned","Service","(Feet)","(Feet)","Location","Customer","Start Date (2)"," Date (2)","(Dollars)","(Dollars)",null,"Q1","Q2","Q3","Q4","Q1","Q2","Q3","Q4"]
["High Specification Floater: Ultra-Deepwater (27)",null,null,null,null,null,null,null,null,null,null,null,null,null,null,null,null,null,null,null,null,null,null,"Q1","Q2","Q3","Q4","Q1","Q2","Q3","Q4",null,null,null,"Q3","Q4","Q1","Q2","Q3","Q4"]
[]
["Discoverer Americas",-6,"ship","«",2009,12000,40000,"Mozambique","Statoil","2013-03-01","2013-09-01",585000,509000,null,0,0,{"$f":"VLOOKUP($A11,'[1]2013'!$B$4:$V$48,20,FALSE)","v":0},{"$f":"VLOOKUP($A11,'[1]2013'!$B$4:$V$48,21,FALSE)","v":0},{"$f":"VLOOKUP($A11,'[1]2014'!$B$4:$R$51,14,FALSE)","v":0},{"$f":"VLOOKUP($A11,'[1]2014'!$B$4:$R$51,15,FALSE)","v":0},{"$f":"VLOOKUP($A11,'[1]2014'!$B$4:$R$51,16,FALSE)","v":45},{"$f":"VLOOKUP($A11,'[1]2014'!$B$4:$R$51,17,FALSE)","v":0},null,0,0,0,0,0,0,45,0,null,null,null,{"$f":"Z11-Q11","v":0},0,0,0,0,0]
[null,"(6), (14)",null,null,null,null,null,"Tanzania","Statoil","2013-09-01","2014-12-31",636000,585000,null," "," ",null,null,null,null,null,null,null," "," "]
[null,-6,null,null,null,null,null,"USGOM","Statoil","2014-12-31","2016-05-01",600000,514000]
["Deepwater Champion",-6,"ship","«",2011,12000,40000,"USGOM","ExxonMobil","2012-06-01","2015-11-01",669000,655000,null,0,0,{"$f":"VLOOKUP($A14,'[1]2013'!$B$4:$V$48,20,FALSE)","v":0},{"$f":"VLOOKUP($A14,'[1]2013'!$B$4:$V$48,21,FALSE)","v":0},0,0,0,0,null,0,0,0,10,0,0,0,0,null,null,null,{"$f":"Z14-Q14","v":0},10,0,0,0,0]
["Discoverer Clear Leader"," (6), (11)","ship","«",2009,12000,40000,"USGOM","Chevron","2010-09-01","2014-09-01",566000,503000,null,0,0,null,null,{"$f":"VLOOKUP($A15,'[1]2014'!$B$4:$R$51,14,FALSE)","v":21},{"$f":"VLOOKUP($A15,'[1]2014'!$B$4:$R$51,15,FALSE)","v":0},{"$f":"VLOOKUP($A15,'[1]2014'!$B$4:$R$51,16,FALSE)","v":0},{"$f":"VLOOKUP($A15,'[1]2014'!$B$4:$R$51,17,FALSE)","v":0},null,0,0,0,0,21,0,0,0,null,null,null,0,0,0,0,0,0]
[null," (6), (8)",null,null,null,null,null,"USGOM","Chevron","2014-09-01","2018-08-01",590000,566000]
["Discoverer Inspiration",-6,"ship","«",2010,12000,40000,"USGOM","Chevron","2010-09-01","2015-03-01",521000,494000,null,0,0,null,null,0,0,0,0,null,0,0,0,0,0,0,0,0,null,null,null,{"$f":"Z17-Q17","v":0},0,0,0,0,0]
[null,"(6), (8)",null,null,null,null,null,"USGOM","Chevron","2015-04-20","2020-04-20",585000,521000,null,null,null,null,null,null,null,null,null,null,null,null,null,null,null,null,null,null,null,null,null,0,0,0,0,0,0]
["Dhirubhai Deepwater KG1",null,"ship","«",2009,12000,35000,"India","Reliance","2009-08-01","2014-07-01",510000,"N/A",null,0,0,{"$f":"VLOOKUP($A19,'[1]2013'!$B$4:$V$48,20,FALSE)","v":0},{"$f":"VLOOKUP($A19,'[1]2013'!$B$4:$V$48,21,FALSE)","v":0},{"$f":"VLOOKUP($A19,'[1]2014'!$B$4:$R$51,14,FALSE)","v":0},{"$f":"VLOOKUP($A19,'[1]2014'!$B$4:$R$51,15,FALSE)","v":5},{"$f":"VLOOKUP($A19,'[1]2014'!$B$4:$R$51,16,FALSE)","v":50},{"$f":"VLOOKUP($A19,'[1]2014'!$B$4:$R$51,17,FALSE)","v":0},null,0,0,0,0,0,5,51,0,null,null,null,0,0,0,0,1,0]
["Dhirubhai Deepwater KG2",null,"ship","«",2010,12000,35000,"India","Reliance","2012-03-01","2015-02-01",510000,573000,null,0,0,null,null,{"$f":"VLOOKUP($A20,'[1]2014'!$B$4:$R$51,14,FALSE)","v":21},{"$f":"VLOOKUP($A20,'[1]2014'!$B$4:$R$51,15,FALSE)","v":0},{"$f":"VLOOKUP($A20,'[1]2014'!$B$4:$R$51,16,FALSE)","v":0},{"$f":"VLOOKUP($A20,'[1]2014'!$B$4:$R$51,17,FALSE)","v":0},null,0,0,0,0,21,0,0,0,null,null,null,0,0,0,0,0,0]
["Discoverer India",-14,"ship","«",2010,12000,40000,"USGOM","Reliance","2011-08-01","2013-09-01",499000,508000,null,8,0,{"$f":"VLOOKUP($A21,'[1]2013'!$B$4:$V$48,20,FALSE)","v":0},{"$f":"VLOOKUP($A21,'[1]2013'!$B$4:$V$48,21,FALSE)","v":0},0,0,0,0,null,8,0,0,0,0,0,0,0,null,null,null,0,0,0,0,0,0]
[null,null,null,null,null,null,null,"USGOM","Reliance","2013-09-01","2016-09-01",528000,499000,null," "," ",null,null,null,null,null,null,null," "," "," "," "," "," "," "," "]
[null,null,null,null,null,null,null,"India","Reliance","2016-09-01","2020-11-01",508000,528000,null," "," ",null,null,null,null,null,null,null," "," "," "," "," "," "," "," "]
["Petrobras 10000"," (6), (7), (8)","ship","«",2009,12000,37500,"Brazil","Petrobras","2011-02-01","2019-08-01",432000,"N/A",null,0,0,null,null,{"$f":"VLOOKUP($A24,'[1]2014'!$B$4:$R$51,14,FALSE)","v":0},{"$f":"VLOOKUP($A24,'[1]2014'!$B$4:$R$51,15,FALSE)","v":30},{"$f":"VLOOKUP($A24,'[1]2014'!$B$4:$R$51,16,FALSE)","v":43},{"$f":"VLOOKUP($A24,'[1]2014'!$B$4:$R$51,17,FALSE)","v":0},null,0,0,0,0,0,30,45,0,null,null,null,{"$f":"Z24-Q24","v":0},0,0,0,2,0]
["Discoverer Deep Seas",-6,"ship","«",2001,10000,35000,"USGOM","Chevron","2011-02-01","2013-09-01",456000,517000,null,0,0,{"$f":"VLOOKUP($A25,'[1]2013'!$B$4:$V$48,20,FALSE)","v":0},{"$f":"VLOOKUP($A25,'[1]2013'!$B$4:$V$48,21,FALSE)","v":0},0,0,0,0,null,0,0,0,0,0,0,0,0,null,null,null,0,0,0,0,0,0]
[null,-6,null,null,null,null,null,"USGOM","Murphy Oil",{"$f":"K25","v":"2013-09-01"},"2016-09-01",595000,595000,null," "," ",null,null,null,null,null,null,null," "," "," "," "," "," "," "," "]
["Discoverer Enterprise",-6,"ship","«",1999,10000,35000,"USGOM","BP","2013-01-01","2014-01-01",515000,523000,null,0,0,0,0,{"$f":"VLOOKUP($A27,'[1]2014'!$B$4:$R$51,14,FALSE)","v":0},{"$f":"VLOOKUP($A27,'[1]2014'!$B$4:$R$51,15,FALSE)","v":12},{"$f":"VLOOKUP($A27,'[1]2014'!$B$4:$R$51,16,FALSE)","v":0},{"$f":"VLOOKUP($A27,'[1]2014'!$B$4:$R$51,17,FALSE)","v":0},null,0,0,0,0,12,0,0,0,null,null,null,{"$f":"Z27-Q27","v":0},0,12,-12,0,0]
["Discoverer Spirit",-6,"ship","«",2000,10000,35000,"USGOM","Anadarko","2012-07-01","2014-06-01",546000,564000,null,0,0,{"$f":"VLOOKUP($A28,'[1]2013'!$B$4:$V$48,20,FALSE)","v":0},{"$f":"VLOOKUP($A28,'[1]2013'!$B$4:$V$48,21,FALSE)","v":7},{"$f":"VLOOKUP($A28,'[1]2014'!$B$4:$R$51,14,FALSE)","v":0},{"$f":"VLOOKUP($A28,'[1]2014'!$B$4:$R$51,15,FALSE)","v":0},{"$f":"VLOOKUP($A28,'[1]2014'!$B$4:$R$51,16,FALSE)","v":84},{"$f":"VLOOKUP($A28,'[1]2014'!$B$4:$R$51,17,FALSE)","v":0},null,0,0,7,0,0,0,90,10,null,null,null,7,-7,0,0,6,10]
["GSF C.R. Luigs",-6,"ship","«",2000,10000,35000,"USGOM","BHP Billiton","2011-12-01","2014-02-01",536000,411000,null,0,0,{"$f":"VLOOKUP($A29,'[1]2013'!$B$4:$V$48,20,FALSE)","v":10},{"$f":"VLOOKUP($A29,'[1]2013'!$B$4:$V$48,21,FALSE)","v":0},0,0,0,0,null,0,0,10,0,0,0,0,0,null,null,null,0,0,0,0,0,0]
["GSF Jack Ryan",-6,"ship","«",2000,10000,35000,"Nigeria","Total","2009-06-01","2014-07-01",445000,297000,null," "," ",null,null,{"$f":"VLOOKUP($A30,'[1]2014'!$B$4:$R$51,14,FALSE)","v":0},{"$f":"VLOOKUP($A30,'[1]2014'!$B$4:$R$51,15,FALSE)","v":0},{"$f":"VLOOKUP($A30,'[1]2014'!$B$4:$R$51,16,FALSE)","v":5},{"$f":"VLOOKUP($A30,'[1]2014'!$B$4:$R$51,17,FALSE)","v":92},null,0,0,0,0,0,0,65,91,null,null,null,null,null,{"$f":"AB30-S30","v":0},0,60,-1]
["Deepwater Discovery"," (6), (7)","ship","«",2000,10000,30000,"Brazil",null,null,"Idle",null,496000,null,0,0,{"$f":"VLOOKUP($A31,'[1]2013'!$B$4:$V$48,20,FALSE)","v":19},{"$f":"VLOOKUP($A31,'[1]2013'!$B$4:$V$48,21,FALSE)","v":0},{"$f":"VLOOKUP($A31,'[1]2014'!$B$4:$R$51,14,FALSE)","v":0},{"$f":"VLOOKUP($A31,'[1]2014'!$B$4:$R$51,15,FALSE)","v":0},{"$f":"VLOOKUP($A31,'[1]2014'!$B$4:$R$51,16,FALSE)","v":0},{"$f":"VLOOKUP($A31,'[1]2014'!$B$4:$R$51,17,FALSE)","v":0},null,0,0,38,23,0,0,0,0,null,null,null,{"$f":"Z31-Q31","v":19},23,0,0,0,0]
["Deepwater Frontier",null,"ship","«",1999,10000,30000,"Australia ","ExxonMobil","2013-02-28","2014-02-01",534000,".",null,0,0,0,0,{"$f":"VLOOKUP($A32,'[1]2014'!$B$4:$R$51,14,FALSE)","v":14},{"$f":"VLOOKUP($A32,'[1]2014'!$B$4:$R$51,15,FALSE)","v":0},{"$f":"VLOOKUP($A32,'[1]2014'!$B$4:$R$51,16,FALSE)","v":0},{"$f":"VLOOKUP($A32,'[1]2014'!$B$4:$R$51,17,FALSE)","v":0},null,0,0,0,0,14,0,0,0,null,null,null,0,0,0,0,0,0]
[null,null,null,null,null,null,null,"Australia ","ExxonMobil","2014-02-28","2014-10-01",565000,534000,null,null,null,null,null,null,null,null,null,null,null,null,null,null,null,null,null,null,null,null,null,0,0,0,0,0,0]
["Deepwater Millennium",-6,"ship","«",1999,10000,30000,"Kenya","Anadarko","2012-12-01","2013-08-01",570000,545000,null,0,0,{"$f":"VLOOKUP($A34,'[1]2013'!$B$4:$V$48,20,FALSE)","v":38},{"$f":"VLOOKUP($A34,'[1]2013'!$B$4:$V$48,21,FALSE)","v":92},{"$f":"VLOOKUP($A34,'[1]2014'!$B$4:$R$51,14,FALSE)","v":54},{"$f":"VLOOKUP($A34,'[1]2014'!$B$4:$R$51,15,FALSE)","v":0},{"$f":"VLOOKUP($A34,'[1]2014'!$B$4:$R$51,16,FALSE)","v":0},{"$f":"VLOOKUP($A34,'[1]2014'!$B$4:$R$51,17,FALSE)","v":0},null,0,0,23,92,52,0,0,0,null,null,null,-15,0,-2,0,0,0]
[null,"(7)",null,null,null,null,null,"Australia","Woodside","2014-02-01","2015-02-01",605000,{"$f":"+L34","v":570000},null," "," ",null,null,null,null,null,null,null," "," "," "," "," "," "," "," "]
[null,"(7)",null,null,null,null,null,"Australia","Woodside",{"$f":"+K35","v":"2015-02-01"},"2016-02-01",615000,{"$f":"+L35","v":605000},null," "," ",null,null,null,null,null,null,null," "," "," "," "," "," "," "," "]
["Deepwater Pathfinder",-6,"ship","«",1998,10000,30000,"USGOM","Eni","2010-08-01","2015-04-01",678000,550000,null,0,0,{"$f":"VLOOKUP($A37,'[1]2013'!$B$4:$V$48,20,FALSE)","v":7},{"$f":"VLOOKUP($A37,'[1]2013'!$B$4:$V$48,21,FALSE)","v":0},0,0,0,0,null,0,0,7,0,0,0,0,0,null,null,null,{"$f":"Z37-Q37","v":0},{"$f":"AA37-R37","v":0},{"$f":"AB37-S37","v":0},{"$f":"AC37-T37","v":0},{"$f":"AD37-U37","v":0},{"$f":"AE37-V37","v":0}]
["Deepwater Expedition",null,"ship","«",1999,8500,30000,"Saudi Arabia","Saudi Aramco","2012-11-01","2014-11-01",650000,640000,null,0,0,0,0,0,0,0,0,null,0,0,0,0,0,0,0,0,null,null,null,0,0,0,0,0,0]
["Cajun Express"," (6), (7)","semi","«",2001,8500,35000,"Morocco/Senegal","Cairn Energy","2013-10-01","2014-10-01",600000,520000,null,0,1,{"$f":"VLOOKUP($A39,'[1]2013'!$B$4:$V$48,20,FALSE)","v":92},{"$f":"VLOOKUP($A39,'[1]2013'!$B$4:$V$48,21,FALSE)","v":13},0,0,0,0,null,0,1,92,8,0,0,0,0,null,null,null,0,-5,0,0,0,0]
["Deepwater Nautilus","(6), (8)","semi",null,2000,8000,30000,"USGOM","Shell","2012-08-01","2017-08-01",529000,551000,null,0,0,0,0,{"$f":"VLOOKUP($A40,'[1]2014'!$B$4:$R$51,14,FALSE)","v":0},{"$f":"VLOOKUP($A40,'[1]2014'!$B$4:$R$51,15,FALSE)","v":0},{"$f":"VLOOKUP($A40,'[1]2014'!$B$4:$R$51,16,FALSE)","v":92},{"$f":"VLOOKUP($A40,'[1]2014'!$B$4:$R$51,17,FALSE)","v":43},null,0,0,0,0,0,0,92,43,null,null,null,0,0,0,0,0,0]
{"$rows_left_out":133}
{"sheet":"Footnotes","index":3,"n_rows":20,"n_cols":3,"rows_kept":20,"cut":false,"hidden":false,"merged":[[17,2,17,13],[10,2,10,13],[11,2,11,13],[4,1,4,2],[8,2,8,13],[6,2,6,13],[7,2,7,13],[9,2,9,13],[12,2,12,13],[15,2,15,13],[13,2,13,13],[14,2,14,13],[16,2,16,13]]}
[]
[null,{"$f":"'Report '!A2","v":"Updated: September 18, 2013"}]
[null,{"$f":"OOS!A3","v":"Revisions Noted in Bold"}]
[]
[null,"Footnotes"]
["Prev"]
["(1)","(1)","Dates shown are the original service date and the date of the most recent upgrade, if any."]
["(2)","(2)","Estimated Contract Start and Estimated Expiration Dates are calculated as follows: (1) for events estimated to occur between the 1st and 15th of a month, the previous month is reported (i.e. a contract which is estimated to commence on May 4, 2013 will be reported as commencing in April 2013) and (2) for events estimated to occur between the 16th and the end of a month, the actual month is reported (i.e. a contract which is estimated to commence on May 24, 2013 will be reported as commencing in May 2013).  Expiration dates represent the company's current estimate of the earliest date the contract for each rig is likely to expire. Some rigs have two or more contracts in continuation, so the last line shows the estimated earliest availability. Many contracts permit the customer to extend the contract.  "]
["(3)","(3)","Represents the full operating dayrate, although the average dayrate over the term of the contract will be lower and could be substantially lower. Does not reflect incentive programs which are typically based on the rig's operating performance against a performance curve. Please refer to the “Customer Contract Duration and Dayrates and Risks Associated with Operations” section of the Disclaimers & Definitions for a description of dayrates.  This column may not reflect the rate currently being received under the contract as a result of an applicable standby rate or other rate, which typically is less than the contract dayrate."]
["(4)","(4)","The out of service time represents those days where a rig is scheduled to be out of service and not be available to earn an operating dayrate. Please refer to the “Out of Service Days (Shipyards, Mobilizations, Demobilizations, Contract Preparation)” section of the Disclaimers & Definitions for a full description.  "]
["(5)","(5)","Estimated Average Contract Dayrate is defined as the average contracted full operating dayrate to be earned per revenue earning day. See note (3) for definition of full operating dayrate."]
["(6)","(6)","Reflects the current contracted dayrate which could reflect prior cost escalations and could change in the future due to further cost escalations."]
["(7)","(7)","Reflects the current contracted dayrate which is comprised of a foreign currency component and which could change due to foreign exchange adjustments."]
["(8)","(8)","Current contract provides for a bonus incentive opportunity not reflected in the stated current contract dayrate."]
["(9)","(9)","For the period of time that this rig is contracted to Applied Drilling Technology International, the drilling management services division of the company's U.K. operating subsidiary, accounting rules require that we eliminate the revenues and costs related to those contracts from the contract drilling segment of the consolidated statement of operations.  Revenues from turnkey contracts will be recognized in other revenues and are contingent upon successful completion of the well program."]
["(10)","(10)","Fixed price options may be exercised at the customer’s discretion. During periods when dayrates on new contracts are increasing relative to existing contracts, the likelihood of customers’ exercising fixed price options increases. During periods when dayrates on new contracts are decreasing relative to existing contracts, the likelihood of customers’ exercising fixed price options declines."]
["(11)","(11)","The contract is expected to start in the quarter indicated.  Factors that could influence the contract start date include shipyard delivery, customer acceptance, and mobilization to operating location, among others."]
[null,"(12)","As mutually agreed between the company and the customer, effective September 5, 2013 the contract was suspended on the deepwater floater Sedco 710.  The company is currently in discussions with the customer regarding the remaining contract backlog on the rig.  The rig will be stacked. "]
[null,"(13)","Falcon 100 is currently held for sale."]
[null,"(14)","The Jack Ryan shipyard extends 52 days into the first quarter of 2015."]

{"sheet":"Stacked&Idle","index":4,"n_rows":165,"n_cols":10,"rows_kept":165,"cut":false,"hidden":true,"merged":[[2,0,2,11],[20,0,20,15]]}
[]
[{"$f":"'Report '!A2","v":"Updated: September 18, 2013"}]
[{"$f":"OOS!A3","v":"Revisions Noted in Bold"}]
[]
["Stacked Rigs"]
["Rig Type/Name","Start Date"]
["Deepwater (2)"]
[]
["Transocean Richardson","2011-03-15"]
["Sovereign Explorer","2010-11-01"]
[]
["Midwater Floaters (5)"]
[]
["Sedco 700","Prior to 2010"]
["GSF Aleutian Key","2010-01-09"]
["Sedco 601","2011-04-09"]
["J.W. McLean","2011-04-13"]
["GSF Arctic I","2013-07-01"]
[]
["Stacked and Idle rigs detailed above are not currently operating on contract.  Start date denotes when rig commences idle or stacked status."]
["An \"Idle\" rig is between contracts, readily available for  operations, and operating costs are typically at or near normal levels.  A \"Stacked\" rig, on the other hand, is manned by a reduced crew or unmanned and typically has reduced operating costs and is (i) preparing for an extended period of inactivity, (ii) expected to continue to be inactive for an extended period, or (iii) completing a period of extended inactivity.  However, stacked rigs will continue to incur operating costs at or above normal operating costs for 30 to 60 days following initiation of stacking."]
[]
[]
[]
[]
[]
[]
[]
[]
[]
[]
[]
[]
[]
[]
[]
[]
[]
[]
[]
{"$rows_left_out":126}
{"sheet":"Disclaimers&Definitions ","index":5,"n_rows":3,"n_cols":1,"rows_kept":3,"cut":false,"hidden":false,"merged":[[2,0,2,11]]}
[" "]
[]
["DISCLAIMERS & DEFINITIONS"]